Report
type: Class
alternative label: 报告
subclass of: R7zvYKadqTXgMZV8ghLsloR
subclass of: RTPFix1eiYqgdushRunICo
definition: A formal record of factual findings, legal conclusions, or proceedings (e.g., meeting, session).