Another Planned Permanent Living Arrangement
type: Class
alternative label: 另一种计划永久居住安排
subclass of: R9gqzNBOvSSiVGWHH7ZIXzM
definition: A planned permanent living arrangement (APPLA) is an alternative option for a child in the foster care system who cannot be reunited with their birth family or adopted, and involves placing the child in a long-term, stable living situation with a caregiver who is not their legal guardian.