X126 Witness Fees
type: Class
subclass of: RtpnOBk4lRnWigpEBBKYUDQ
definition: Any sheriff or service fees and other costs associated with the testimony of a witness at court or in a similar legal proceeding