New York Supreme Court - Schenectady County
type: Class
subclass of: R06956a0657387D6513A8528
definition: The New York Supreme Court - Schenectady County is a court of general jurisdiction located in Schenectady County, New York, with authority to hear and decide legal disputes within its geographic jurisdiction.