Short Form Lease Clause
type: Class
alternative label: 短期租赁条款
subclass of: RDe0RKU39BlhcyACJW30ZLc
definition: A short form lease clause is a provision within a contract that outlines the terms and conditions of a lease agreement in a concise manner.