Witness Examination Practice
type: Class
alternative label: 证人审讯实践
subclass of: R9dd6R73IfKyiskT5Jf62R7
definition: The Witness Examination Practice is a legal practice that involves questioning a witness in a legal proceeding, either through cross-examination or direct-examination, and is a subset of Trial Practice.