inv_desc
type: Class
subclass of: RHfeijrOTjaF7qpuoGIGkR
definition: "A descriptive summary of work performed. It is expected that this field will be picked up by receiving system and displayed to bill reviewers. "