JB10 Budgeting - own side's costs (UK J-CODE)
type: Class
subclass of: Rk7IHXZjHuFGynkWmz9uoK
definition: Preparing budgets solely for the client and monitoring costs incurred for the purposes of any required variations. Performing budgetary work related to obtaining third party funding/ATE insurance.