Civil Sexual Battery
type: Class
alternative label: 民事性侵犯
subclass of: R7N71UJvQpaL7vVEjmFExh6
definition: Civil Sexual Battery: A type of civil battery that involves the intentional and unwanted sexual touching of another person, without their consent.