Motion to Avoid Lien on Household Goods
type: Class
alternative label: 避免对家庭用品设定留置权动议
subclass of: RuFYyZorYWUSsV5u02JBYb
definition: A Motion to Avoid Lien on Household Goods is a legal request to remove a lien on personal property that is essential for daily living, such as furniture and appliances.