Indiana Circuit Court - LaPorte County
type: Class
subclass of: RCeiXNGpqL4H3jo1g1NobSm
definition: A court of general jurisdiction in Indiana that hears civil and criminal cases within LaPorte County.