Refugee
type: Class
subclass of: R8GuYn7yMmfL0coiNQ0OE8f
definition: In the context of immigration law, a "Refugee" is someone who has been forced to flee their home country due to a well-founded fear of persecution. That fear is often based on race, religion, nationality, political opinion, or membership in a particular social group.