Settlement Clause
type: Class
alternative label: 结算条款
subclass of: RDe0RKU39BlhcyACJW30ZLc
definition: A settlement clause is a provision in a contract that outlines the terms and conditions for resolving disputes between parties.