Material Change Report
type: Class
preferred label: Current Report
alternative label: Significant Event Disclosure
subclass of: RmCERXtzdqIJcW9mdbk0Bb
definition: A Material Change Report, also known as a Current Report, is a document filed with securities regulators that discloses significant events or changes affecting a company. This could include changes in management, mergers, or other events that could impact the stock price.