AAA International Dispute Resolution Procedures
type: Class
alternative label: AAA国际争议解决程序
subclass of: R7uzfpLbCGc2taU7nsJBuor
definition: AAA International Dispute Resolution Procedures refer to the specific rules and procedures established by the American Arbitration Association for resolving international disputes through arbitration.