Nanny Visa
type: Class
alternative label: B-1 Visa
alternative label: Childcare Worker Visa
alternative label: Domestic Helper Visa
subclass of: RD1oQDMlC6FytjOndhJTMy8
definition: A Nanny Visa authorizes a foreign national to enter and work in a host country as a live-in or live-out caregiver, primarily for children of certain non-immigrant workers.