Bankruptcy Chapter 13 Claim
type: Class
alternative label: 破产第13章索赔
subclass of: R7vBjMmDitSBmBKZvNugCLG
definition: A Bankruptcy Chapter 13 Claim is a type of claim made in a bankruptcy case that allows individuals with regular income to develop a plan to repay all or part of their debts over a period of time.