Contact State or Province
type: Class
alternative label: 联系州或省
subclass of: R8QBuMoK1uPFeLW0sg40CdA
definition: Contact State or Province refers to the geographic location of a person or entity's contact information, such as their address, within a specific state or province.