Patent-Agent Privilege
type: Class
alternative label: 专利代理人特权
subclass of: Rxkyjui3De88JNN2ZCqKrt
definition: The Patent-Agent Privilege is a legal protection that allows communications between a patent agent and their client to remain confidential and not be disclosed in court, similar to attorney-client privilege.