Economic Loss Doctrine
type: Class
alternative label: 经济损失原则
subclass of: RCfunX4u69LUQ3gbhckE0oI
subclass of: RCzs34uEQI9f4cuWp3bQO0P
definition: The Economic Loss Doctrine is a legal principle that limits recovery in negligence claims to only economic losses, such as lost profits or property damage, and excludes recovery for personal injury or other non-economic losses.