Per Diem Clause
type: Class
alternative label: 日支出条款
subclass of: RDe0RKU39BlhcyACJW30ZLc
definition: A per diem clause is a provision in a contract that specifies a daily allowance or rate of payment for expenses incurred by one party while performing duties for the other party.