Fiduciary Relationship
type: Class
alternative label: 受托人关系
subclass of: RtmRdqzdG4lddVrtCToiL1
definition: A fiduciary relationship is a legal relationship in which one party is entrusted with the care and management of another party's assets or interests, and is obligated to act in the best interests of the other party, with loyalty, honesty, and good faith.