Notice of Bankruptcy
type: Class
alternative label: 破产通知
subclass of: RB3FT9lFNQIjRnFIueLgCa7
definition: A Notice of Bankruptcy is a formal written communication that informs creditors and other interested parties that an individual or entity has filed for bankruptcy protection.