Motions for Bail
type: Class
alternative label: 保释动议
subclass of: RbAyL0ru5m8CyqAShGVq0e
definition: A Motion for Bail is a formal request made to a court by a defendant or their attorney, asking for the release of the defendant from custody pending trial or appeal.