Deportation
type: Class
alternative label: 驱逐
subclass of: R0tJKDoGSixec7FgGKnAAl
subclass of: R73Uo5x4VyfiOXt6i4R256t
subclass of: RBEXxc9B6kR2p0BMwGjhWGW
subclass of: RDbz1PVc6y57oOb9jAIl0eN
definition: The forced removal of a person from a country by the government as a consequence of violating immigration laws or committing a crime.