Conflict of Interest Clause
type: Class
alternative label: 利益冲突条款
subclass of: RDe0RKU39BlhcyACJW30ZLc
definition: A Conflict of Interest Clause is a provision in a contract that requires the parties involved to disclose any potential conflicts of interest that may arise during the course of their relationship.