Georgia District Court - Bryan County
type: Class
subclass of: RBxw7BF15bDA0Ifn2vOrC8h
definition: Georgia District Court - Bryan County: A court of law in the state of Georgia that has jurisdiction over legal cases and disputes specifically within Bryan County.