Contact City
type: Class
alternative label: 联系城市
subclass of: R8QBuMoK1uPFeLW0sg40CdA
definition: Contact City refers to the city where a person or entity can be reached and is a subcategory of Contact Information in the context of Engagement Terms for providing legal services.