Dependent Personality Disorder
type: Class
subclass of: RCnCHWsREqpfQAAfaN2lRPV
definition: Dependent Personality Disorder is characterized by a pervasive and excessive need to be taken care of, leading to submissive and clinging behaviors and fears of separation. Individuals with this disorder have difficulty making independent decisions and rely heavily on others for emotional and practical support.