Some Evidence
type: Class
alternative label: 一些证据
subclass of: RDV74m3ydS2I72hZ88Mf1RX
definition: Some Evidence refers to any type of proof or information presented in a legal case that supports one party's argument or position, and falls under the burden of proof required in litigation.