Wildlife Crimes
type: Class
preferred label: Wildlife Offenses
subclass of: R7V9R3w28BDjOd4lLUUrvQ5
definition: Wildlife Crimes involve illegal activities that harm wildlife species, including poaching, trafficking, and illegal trade. These crimes violate national and international laws aimed at protecting endangered and protected species.