Telephone Consumer Protection Act Claim
type: Class
alternative label: 《电话消费者保护法》索赔
subclass of: R9LVBKjvGRuzwgtlhuLST36
definition: A Telephone Consumer Protection Act (TCPA) Claim is a legal claim made under the TCPA statute, which prohibits certain telemarketing practices and provides consumers with certain rights related to unwanted phone calls and text messages.