Joint and Several Liability
type: Class
alternative label: 连带责任
subclass of: R9b5fs8QJuliSZYeaJLJU2t
definition: Joint and Several Liability is a legal concept where multiple parties can be held responsible for the same damages or debt, and each party can be held liable for the entire amount.