Motion to Hear Case with Other Case
type: Class
alternative label: 将案件与其他案件一起听案的动议
subclass of: RbAyL0ru5m8CyqAShGVq0e
definition: A Motion to Hear Case with Other Case is a formal request made in appellate courts to consolidate two or more cases for hearing together.