Rules of the Judicial Panel on Multidistrict Litigation
type: Class
alternative label: 多区域诉讼司法小组规则
subclass of: RDaNIjG3Bz5mnMEssDHDHwf
definition: U.S. federal courts' body of procedural rules governing Multidistrict Litigation (MDLs).