Probate Reason of Financial Exploitation
type: Class
alternative label: 财务剥削遗嘱理由
subclass of: RI5hwGjH6o0HX7MTQbZm3Q
definition: Probate Reason of Financial Exploitation: A legal cause for initiating a probate filing due to the suspected or proven financial exploitation of a deceased person.