Florida Circuit Court - Bay County - 14th Circuit Court
type: Class
subclass of: R3Q1HDu5jO8nvhdbr2Uj0c
definition: A court located in Bay County, Florida that is part of the larger Florida Circuit Court system.