Georgia Superior Court - Henry County
type: Class
subclass of: RCBE5bLTCIia7wAstjMsnKO
definition: Georgia Superior Court - Henry County: A court of general jurisdiction in the state of Georgia that has authority over civil and criminal cases within Henry County.