Georgia Superior Court - Colquitt County
type: Class
subclass of: RCBE5bLTCIia7wAstjMsnKO
definition: A court of general jurisdiction in the state of Georgia that has authority over civil and criminal cases within Colquitt County.