Estoppel Letters Clause
type: Class
alternative label: 禁止抗辩信函条款
subclass of: RDe0RKU39BlhcyACJW30ZLc
definition: A clause in a contract that prevents a party from denying certain facts or legal rights that have already been established or agreed upon in a previous communication.