Mississippi Ethics Opinions
type: Class
subclass of: R8A4a837BE2d5AB3c793565b
definition: Mississippi Ethics Opinions are official statements issued by the Mississippi State Courts that provide guidance on ethical issues faced by attorneys and judges in the state of Mississippi.