Persian
type: Class
alternative label: 波斯语
subclass of: RDOvAHsvY8TKJ1O1orXPM9o
definition: Persian (Language) is a structured system of communication that consists of grammar and vocabulary, and is a member of the Language class, used in legal matters.