Non-current Law
type: Class
preferred label: Citator - Red Flag
alternative label: 非现行法律
subclass of: RtSews3LsWL6xdoibt5V5R
definition: The previously effective law currently appears to have no legal efficacy, having been displaced (e.g., overruled, reversed, vacated, superseded).