Guardian Ad Litem Attorney
type: Class
alternative label: 监护人代理律师
subclass of: RcTA2iQmrtqOnX3WrjJIp8
definition: A Guardian Ad Litem (GAL) Attorney is a type of lawyer who is appointed by the court to represent the best interests of a child or incapacitated adult in a legal proceeding.