Lease Practice
type: Class
preferred label: Leasing Practice
alternative label: 租赁实践
subclass of: RKzL5nW7IGg4mvAPFX2MUL
hidden label: LEA
definition: A contract by which one party (landlord, or lessor) gives to another (tenant, or lessee) the use and possession of lands, buildings, property, etc. for a specified time and for fixed payments.