LAW_FIRM_ADDRESS_1
type: Class
subclass of: RDkx69t1kBP7tevuzMMsqha
definition: The concept LAW_FIRM_ADDRESS_1 refers to the first line of the address of a law firm and is a component of the LEDES98BI V5 Format Rev 1-2020 standard for electronic legal invoicing.