oasis:Expression
type: Class
subclass of: RG06B87qkXrj4iQBwonhRb
definition: A type of metadata that describes a work of art or literature, including its author, title, and other identifying information.