Diversity Jurisdiction
type: Class
alternative label: विविधता अधिकार
subclass of: ReswYRsH8IbmoE68QpgOCd
definition: The concept of Diversity Jurisdiction refers to the authority of a federal court to hear a case between parties from different states or countries, where the amount in controversy exceeds a certain threshold.