Payment Defense
type: Class
alternative label: 付款保护
subclass of: RBAoFbSK8WP6xJyVrgQd5PZ
subclass of: RCzs34uEQI9f4cuWp3bQO0P
definition: A Payment Defense is a legal argument or strategy used by a defendant in a civil litigation case to refute or deny the plaintiff's claim for payment.