Engagement Arrangements
type: Class
alternative label: 参与安排
subclass of: R9kmGZf5FSmFdouXWQ1Nndm
definition: Ancillary engagement terms and features that the Provider may provide the Buyer, which may or may not involve remuneration.